Strange error during code generation using CCSv5.5

조회 수: 3 (최근 30일)
Mateusz {ychlewicz
Mateusz {ychlewicz 2015년 4월 24일
답변: Venkatachala Sarma 2016년 6월 3일
Hello, I'm trying to make a project using Simulink and F2812 processor. I've done all configuration needed. Whenever I try to generate code I'm getting this error all the time:
The call to idelink_grt_make_rtw_hook, during the exit hook generated the following error: Error while building the project.
The build process will terminate as a result.
Caused by: Error while building the project. The build failed with the following message: "D:/Apps/TI/ccsv5/tools/compiler/c2000_6.2.0/bin/cl2000" -I"D:/Apps/MATLAB 2013/toolbox/idelink/extensions/ticcs/inc" -I"D:/Studia/ -I"D:/Apps/TI/ccsv5/tools/compiler/c2000_6.2.0/include" -fr"./derived/" ./rt_sim.c ./DSP281x_CodeStartBranch.asm ./DSP281x_CpuTimers.c ./DSP281x_DefaultIsr.c ./DSP281x_GlobalVariableDefs.c ./DSP281x_MemCopy.c ./DSP281x_PieCtrl.c ./DSP281x_PieVect.c ./DSP281x_SysCtrl.c ./DSP281x_usDelay.asm ./MW_c28xx_csl.c ./rtGetInf.c ./rtGetNaN.c ./rt_nonfinite.c ./untitled.c ./untitled_data.c ./untitled_main.c >> ERROR: no source files, nothing to do "D:/Apps/TI/ccsv5/tools/compiler/c2000_6.2.0/bin/cl2000" -I"D:/Apps/MATLAB 2013/toolbox/idelink/extensions/ticcs/inc" -I"D:/Studia/ -I"D:/Apps/TI/ccsv5/tools/compiler/c2000_6.2.0/include" -fr"./derived/" ./rt_sim.c ./DSP281x_CodeStartBranch.asm ./DSP281x_CpuTimers.c ./DSP281x_DefaultIsr.c ./DSP281x_GlobalVariableDefs.c ./DSP281x_MemCopy.c ./DSP281x_PieCtrl.c ./DSP281x_PieVect.c ./DSP281x_SysCtrl.c ./DSP281x_usDelay.asm ./MW_c28xx_csl.c ./rtGetInf.c ./rtGetNaN.c ./rt_nonfinite.c ./untitled.c ./untitled_data.c ./untitled_main.c >> ERROR: no source files, nothing to do "D:/Apps/TI/ccsv5/tools/compiler/c2000_6.2.0/bin/cl2000" -I"D:/Apps/MATLAB 2013/toolbox/idelink/extensions/ticcs/inc" -I"D:/Studia/ -I"D:/Apps/TI/ccsv5/tools/compiler/c2000_6.2.0/include" -fr"./derived/" ./rt_sim.c ./DSP281x_CodeStartBranch.asm ./DSP281x_CpuTimers.c ./DSP281x_DefaultIsr.c ./DSP281x_GlobalVariableDefs.c ./DSP281x_MemCopy.c ./DSP281x_PieCtrl.c ./DSP281x_PieVect.c ./DSP281x_SysCtrl.c ./DSP281x_usDelay.asm ./MW_c28xx_csl.c ./rtGetInf.c ./rtGetNaN.c ./rt_nonfinite.c ./untitled.c ./untitled_data.c ./untitled_main.c >> ERROR: no source files, nothing to do "D:/Apps/TI/ccsv5/tools/compiler/c2000_6.2.0/bin/cl2000" -I"D:/Apps/MATLAB 2013/toolbox/idelink/extensions/ticcs/inc" -I"D:/Studia/ -I"D:/Apps/TI/ccsv5/tools/compiler/c2000_6.2.0/include" -fr"./derived/" ./rt_sim.c ./DSP281x_CodeStartBranch.asm ./DSP281x_CpuTimers.c ./DSP281x_DefaultIsr.c ./DSP281x_GlobalVariableDefs.c ./DSP281x_MemCopy.c ./DSP281x_PieCtrl.c ./DSP281x_PieVect.c ./DSP281x_SysCtrl.c ./DSP281x_usDelay.asm ./MW_c28xx_csl.c ./rtGetInf.c ./rtGetNaN.c ./rt_nonfinite.c ./untitled.c ./untitled_data.c ./untitled_main.c >> ERROR: no source files, nothing to do "D:/Apps/TI/ccsv5/tools/compiler/c2000_6.2.0/bin/cl2000" -I"D:/Apps/MATLAB 2013/toolbox/idelink/extensions/ticcs/inc" -I"D:/Studia/ -I"D:/Apps/TI/ccsv5/tools/compiler/c2000_6.2.0/include" -fr"./derived/" ./rt_sim.c ./DSP281x_CodeStartBranch.asm ./DSP281x_CpuTimers.c ./DSP281x_DefaultIsr.c ./DSP281x_GlobalVariableDefs.c ./DSP281x_MemCopy.c ./DSP281x_PieCtrl.c ./DSP281x_PieVect.c ./DSP281x_SysCtrl.c ./DSP281x_usDelay.asm ./MW_c28xx_csl.c ./rtGetInf.c ./rtGetNaN.c ./rt_nonfinite.c ./untitled.c ./untitled_data.c ./untitled_main.c >> ERROR: no source files, nothing to do "D:/Apps/TI/ccsv5/tools/compiler/c2000_6.2.0/bin/cl2000" -I"D:/Apps/MATLAB 2013/toolbox/idelink/extensions/ticcs/inc" -I"D:/Studia/ -I"D:/Apps/TI/ccsv5/tools/compiler/c2000_6.2.0/include" -fr"./derived/" ./rt_sim.c ./DSP281x_CodeStartBranch.asm ./DSP281x_CpuTimers.c ./DSP281x_DefaultIsr.c ./DSP281x_GlobalVariableDefs.c ./DSP281x_MemCopy.c ./DSP281x_PieCtrl.c ./DSP281x_PieVect.c ./DSP281x_SysCtrl.c ./DSP281x_usDelay.asm ./MW_c28xx_csl.c ./rtGetInf.c ./rtGetNaN.c ./rt_nonfinite.c ./untitled.c ./untitled_data.c ./untitled_main.c >> ERROR: no source files, nothing to do "D:/Apps/TI/ccsv5/tools/compiler/c2000_6.2.0/bin/cl2000" -I"D:/Apps/MATLAB 2013/toolbox/idelink/extensions/ticcs/inc" -I"D:/Studia/ -I"D:/Apps/TI/ccsv5/tools/compiler/c2000_6.2.0/include" -fr"./derived/" ./rt_sim.c ./DSP281x_CodeStartBranch.asm ./DSP281x_CpuTimers.c ./DSP281x_DefaultIsr.c ./DSP281x_GlobalVariableDefs.c ./DSP281x_MemCopy.c ./DSP281x_PieCtrl.c ./DSP281x_PieVect.c ./DSP281x_SysCtrl.c ./DSP281x_usDelay.asm ./MW_c28xx_csl.c ./rtGetInf.c ./rtGetNaN.c ./rt_nonfinite.c ./untitled.c ./untitled_data.c ./untitled_main.c >> ERROR: no source files, nothing to do "D:/Apps/TI/ccsv5/tools/compiler/c2000_6.2.0/bin/cl2000" -I"D:/Apps/MATLAB 2013/toolbox/idelink/extensions/ticcs/inc" -I"D:/Studia/ -I"D:/Apps/TI/ccsv5/tools/compiler/c2000_6.2.0/include" -fr"./derived/" ./rt_sim.c ./DSP281x_CodeStartBranch.asm ./DSP281x_CpuTimers.c ./DSP281x_DefaultIsr.c ./DSP281x_GlobalVariableDefs.c ./DSP281x_MemCopy.c ./DSP281x_PieCtrl.c ./DSP281x_PieVect.c ./DSP281x_SysCtrl.c ./DSP281x_usDelay.asm ./MW_c28xx_csl.c ./rtGetInf.c ./rtGetNaN.c ./rt_nonfinite.c ./untitled.c ./untitled_data.c ./untitled_main.c >> ERROR: no source files, nothing to do "D:/Apps/TI/ccsv5/tools/compiler/c2000_6.2.0/bin/cl2000" -I"D:/Apps/MATLAB 2013/toolbox/idelink/extensions/ticcs/inc" -I"D:/Studia/ -I"D:/Apps/TI/ccsv5/tools/compiler/c2000_6.2.0/include" -fr"./derived/" ./rt_sim.c ./DSP281x_CodeStartBranch.asm ./DSP281x_CpuTimers.c ./DSP281x_DefaultIsr.c ./DSP281x_GlobalVariableDefs.c ./DSP281x_MemCopy.c ./DSP281x_PieCtrl.c ./DSP281x_PieVect.c ./DSP281x_SysCtrl.c ./DSP281x_usDelay.asm ./MW_c28xx_csl.c ./rtGetInf.c ./rtGetNaN.c ./rt_nonfinite.c ./untitled.c ./untitled_data.c ./untitled_main.c >> ERROR: no source files, nothing to do "D:/Apps/TI/ccsv5/tools/compiler/c2000_6.2.0/bin/cl2000" -I"D:/Apps/MATLAB 2013/toolbox/idelink/extensions/ticcs/inc" -I"D:/Studia/ -I"D:/Apps/TI/ccsv5/tools/compiler/c2000_6.2.0/include" -fr"./derived/" ./rt_sim.c ./DSP281x_CodeStartBranch.asm ./DSP281x_CpuTimers.c ./DSP281x_DefaultIsr.c ./DSP281x_GlobalVariableDefs.c ./DSP281x_MemCopy.c ./DSP281x_PieCtrl.c ./DSP281x_PieVect.c ./DSP281x_SysCtrl.c ./DSP281x_usDelay.asm ./MW_c28xx_csl.c ./rtGetInf.c ./rtGetNaN.c ./rt_nonfinite.c ./untitled.c ./untitled_data.c ./untitled_main.c >> ERROR: no source files, nothing to do "D:/Apps/TI/ccsv5/tools/compiler/c2000_6.2.0/bin/cl2000" -I"D:/Apps/MATLAB 2013/toolbox/idelink/extensions/ticcs/inc" -I"D:/Studia/ -I"D:/Apps/TI/ccsv5/tools/compiler/c2000_6.2.0/include" -fr"./derived/" ./rt_sim.c ./DSP281x_CodeStartBranch.asm ./DSP281x_CpuTimers.c ./DSP281x_DefaultIsr.c ./DSP281x_GlobalVariableDefs.c ./DSP281x_MemCopy.c ./DSP281x_PieCtrl.c ./DSP281x_PieVect.c ./DSP281x_SysCtrl.c ./DSP281x_usDelay.asm ./MW_c28xx_csl.c ./rtGetInf.c ./rtGetNaN.c ./rt_nonfinite.c ./untitled.c ./untitled_data.c ./untitled_main.c >> ERROR: no source files, nothing to do "D:/Apps/TI/ccsv5/tools/compiler/c2000_6.2.0/bin/cl2000" -I"D:/Apps/MATLAB 2013/toolbox/idelink/extensions/ticcs/inc" -I"D:/Studia/ -I"D:/Apps/TI/ccsv5/tools/compiler/c2000_6.2.0/include" -fr"./derived/" ./rt_sim.c ./DSP281x_CodeStartBranch.asm ./DSP281x_CpuTimers.c ./DSP281x_DefaultIsr.c ./DSP281x_GlobalVariableDefs.c ./DSP281x_MemCopy.c ./DSP281x_PieCtrl.c ./DSP281x_PieVect.c ./DSP281x_SysCtrl.c ./DSP281x_usDelay.asm ./MW_c28xx_csl.c ./rtGetInf.c ./rtGetNaN.c ./rt_nonfinite.c ./untitled.c ./untitled_data.c ./untitled_main.c >> ERROR: no source files, nothing to do "D:/Apps/TI/ccsv5/tools/compiler/c2000_6.2.0/bin/cl2000" -I"D:/Apps/MATLAB 2013/toolbox/idelink/extensions/ticcs/inc" -I"D:/Studia/ -I"D:/Apps/TI/ccsv5/tools/compiler/c2000_6.2.0/include" -fr"./derived/" ./rt_sim.c ./DSP281x_CodeStartBranch.asm ./DSP281x_CpuTimers.c ./DSP281x_DefaultIsr.c ./DSP281x_GlobalVariableDefs.c ./DSP281x_MemCopy.c ./DSP281x_PieCtrl.c ./DSP281x_PieVect.c ./DSP281x_SysCtrl.c ./DSP281x_usDelay.asm ./MW_c28xx_csl.c ./rtGetInf.c ./rtGetNaN.c ./rt_nonfinite.c ./untitled.c ./untitled_data.c ./untitled_main.c >> ERROR: no source files, nothing to do "D:/Apps/TI/ccsv5/tools/compiler/c2000_6.2.0/bin/cl2000" -I"D:/Apps/MATLAB 2013/toolbox/idelink/extensions/ticcs/inc" -I"D:/Studia/ -I"D:/Apps/TI/ccsv5/tools/compiler/c2000_6.2.0/include" -fr"./derived/" ./rt_sim.c ./DSP281x_CodeStartBranch.asm ./DSP281x_CpuTimers.c ./DSP281x_DefaultIsr.c ./DSP281x_GlobalVariableDefs.c ./DSP281x_MemCopy.c ./DSP281x_PieCtrl.c ./DSP281x_PieVect.c ./DSP281x_SysCtrl.c ./DSP281x_usDelay.asm ./MW_c28xx_csl.c ./rtGetInf.c ./rtGetNaN.c ./rt_nonfinite.c ./untitled.c ./untitled_data.c ./untitled_main.c >> ERROR: no source files, nothing to do "D:/Apps/TI/ccsv5/tools/compiler/c2000_6.2.0/bin/cl2000" -I"D:/Apps/MATLAB 2013/toolbox/idelink/extensions/ticcs/inc" -I"D:/Studia/ -I"D:/Apps/TI/ccsv5/tools/compiler/c2000_6.2.0/include" -fr"./derived/" ./rt_sim.c ./DSP281x_CodeStartBranch.asm ./DSP281x_CpuTimers.c ./DSP281x_DefaultIsr.c ./DSP281x_GlobalVariableDefs.c ./DSP281x_MemCopy.c ./DSP281x_PieCtrl.c ./DSP281x_PieVect.c ./DSP281x_SysCtrl.c ./DSP281x_usDelay.asm ./MW_c28xx_csl.c ./rtGetInf.c ./rtGetNaN.c ./rt_nonfinite.c ./untitled.c ./untitled_data.c ./untitled_main.c >> ERROR: no source files, nothing to do "D:/Apps/TI/ccsv5/tools/compiler/c2000_6.2.0/bin/cl2000" -I"D:/Apps/MATLAB 2013/toolbox/idelink/extensions/ticcs/inc" -I"D:/Studia/ -I"D:/Apps/TI/ccsv5/tools/compiler/c2000_6.2.0/include" -fr"./derived/" ./rt_sim.c ./DSP281x_CodeStartBranch.asm ./DSP281x_CpuTimers.c ./DSP281x_DefaultIsr.c ./DSP281x_GlobalVariableDefs.c ./DSP281x_MemCopy.c ./DSP281x_PieCtrl.c ./DSP281x_PieVect.c ./DSP281x_SysCtrl.c ./DSP281x_usDelay.asm ./MW_c28xx_csl.c ./rtGetInf.c ./rtGetNaN.c ./rt_nonfinite.c ./untitled.c ./untitled_data.c ./untitled_main.c >> ERROR: no source files, nothing to do "D:/Apps/TI/ccsv5/tools/compiler/c2000_6.2.0/bin/cl2000" -I"D:/Apps/MATLAB 2013/toolbox/idelink/extensions/ticcs/inc" -I"D:/Studia/ -I"D:/Apps/TI/ccsv5/tools/compiler/c2000_6.2.0/include" -fr"./derived/" ./rt_sim.c ./DSP281x_CodeStartBranch.asm ./DSP281x_CpuTimers.c ./DSP281x_DefaultIsr.c ./DSP281x_GlobalVariableDefs.c ./DSP281x_MemCopy.c ./DSP281x_PieCtrl.c ./DSP281x_PieVect.c ./DSP281x_SysCtrl.c ./DSP281x_usDelay.asm ./MW_c28xx_csl.c ./rtGetInf.c ./rtGetNaN.c ./rt_nonfinite.c ./untitled.c ./untitled_data.c ./untitled_main.c >> ERROR: no source files, nothing to do "D:/Apps/TI/ccsv5/tools/compiler/c2000_6.2.0/bin/cl2000" -z -I"D:/Apps/TI/ccsv5/tools/compiler/c2000_6.2.0/lib" -l"rts2800_ml.lib" -c -x -m"untitled.map" -stack0x200 -o ./CustomMW/untitled.out ./derived/rt_sim.obj ./derived/DSP281x_CodeStartBranch.obj ./derived/DSP281x_CpuTimers.obj ./derived/DSP281x_DefaultIsr.obj ./derived/DSP281x_GlobalVariableDefs.obj ./derived/DSP281x_MemCopy.obj ./derived/DSP281x_PieCtrl.obj ./derived/DSP281x_PieVect.obj ./derived/DSP281x_SysCtrl.obj ./derived/DSP281x_usDelay.obj ./derived/MW_c28xx_csl.obj ./derived/rtGetInf.obj ./derived/rtGetNaN.obj ./derived/rt_nonfinite.obj ./derived/untitled.obj ./derived/untitled_data.obj ./derived/untitled_main.obj ./untitled.cmd ../../../Apps/MATLAB\ 2013/toolbox/idelink/extensions/ticcs/rtlib/IQmath.lib Linking "C:\Users\Mateusz\AppData\Local\Temp\110843", line 10: error: cannot find file "./derived/rt_sim.obj" "C:\Users\Mateusz\AppData\Local\Temp\110843", line 11: error: cannot find file "./derived/DSP281x_CodeStartBranch.obj" "C:\Users\Mateusz\AppData\Local\Temp\110843", line 12: error: cannot find file "./derived/DSP281x_CpuTimers.obj" "C:\Users\Mateusz\AppData\Local\Temp\110843", line 13: error: cannot find file "./derived/DSP281x_DefaultIsr.obj" "C:\Users\Mateusz\AppData\Local\Temp\110843", line 14: error: cannot find file "./derived/DSP281x_GlobalVariableDefs.obj" "C:\Users\Mateusz\AppData\Local\Temp\110843", line 15: error: cannot find file "./derived/DSP281x_MemCopy.obj" "C:\Users\Mateusz\AppData\Local\Temp\110843", line 16: error: cannot find file "./derived/DSP281x_PieCtrl.obj" "C:\Users\Mateusz\AppData\Local\Temp\110843", line 17: error: cannot find file "./derived/DSP281x_PieVect.obj" "C:\Users\Mateusz\AppData\Local\Temp\110843", line 18: error: cannot find file "./derived/DSP281x_SysCtrl.obj" "C:\Users\Mateusz\AppData\Local\Temp\110843", line 19: error: cannot find file "./derived/DSP281x_usDelay.obj" "C:\Users\Mateusz\AppData\Local\Temp\110843", line 20: error: cannot find file "./derived/MW_c28xx_csl.obj" "C:\Users\Mateusz\AppData\Local\Temp\110843", line 21: error: cannot find file "./derived/rtGetInf.obj" "C:\Users\Mateusz\AppData\Local\Temp\110843", line 22: error: cannot find file "./derived/rtGetNaN.obj" "C:\Users\Mateusz\AppData\Local\Temp\110843", line 23: error: cannot find file "./derived/rt_nonfinite.obj" "C:\Users\Mateusz\AppData\Local\Temp\110843", line 24: error: cannot find file "./derived/untitled.obj" "C:\Users\Mateusz\AppData\Local\Temp\110843", line 25: error: cannot find file "./derived/untitled_data.obj" "C:\Users\Mateusz\AppData\Local\Temp\110843", line 26: error: cannot find file "./derived/untitled_main.obj" "C:\Users\Mateusz\AppData\Local\Temp\110843", line 28: error: cannot find file "../../../Apps/MATLAB\ " "C:\Users\Mateusz\AppData\Local\Temp\110843", line 29: error: cannot find file "2013/toolbox/idelink/extensions/ticcs/rtlib/IQmath.lib"
undefined first referenced symbol in file --------- ---------------- _main D:/Apps/TI/ccsv5/tools/compiler/c2000_6.2.0/lib/rts2800_ml.lib<args_main.obj>
error: unresolved symbols remain error: errors encountered during linking; "./CustomMW/untitled.out" not built
>> Compilation failure gmake: * [CustomMW/untitled.out] Error 1
There is no file called "110843" in this path: "C:\Users\Mateusz\AppData\Local\Temp\110843" and every time I try the "numbers" in file name are different but still file doesn't exists. I'm using CCSv5.5, Matlab R2013a, F2812 processor using USB.
Can anyone help me?
  댓글 수: 1
Venkatachala Sarma
Venkatachala Sarma 2016년 6월 3일
Which system target file are you using? Could you try ert.tlc and let me know if you are facing the same issue?

댓글을 달려면 로그인하십시오.

답변 (1개)

Venkatachala Sarma
Venkatachala Sarma 2016년 6월 3일
'no source files, nothing to do' in the log suggests that the support package installation might be old. Please check if you have the latest release of hardware support package installed 1. Execute the following in the MATLAB Command window >> supportPackageInstaller 2. Select Install from Internet 3. Choose Texas Instruments C2000 4. Check the Installed Version and Latest Version of the support package 5. If the Installed Version is not equal to Latest Version, please install the latest version of support package by clicking next
Let me know if it works

태그

Community Treasure Hunt

Find the treasures in MATLAB Central and discover how the community can help you!

Start Hunting!

Translated by